{"text_format":"1","workbook":"xlsx","n_sheets":3,"sheets":["Course planner","Schedule planner","Courses chosen"],"not_rendered":{"charts":0,"images":0,"macros":1,"external_links":2,"defined_names":2,"comments":0,"pivot_tables":0},"unopened":[],"bounds":{"document_bytes":16777216,"sheet_cells":100000,"rows_first":2000,"rows_last":500,"rows_between":2000,"halvings":0,"cell_chars":16384,"cell_head_chars":4096},"cells_cut":0,"cells_raw":0,"read":"whole","date_system":"1900"}

{"sheet":"Course planner","index":0,"n_rows":161,"n_cols":15,"rows_kept":161,"cut":false,"hidden":false,"merged":[[2,7,12,14],[24,1,24,5],[15,7,23,14],[24,7,24,13]]}
[]
[null,"Fundamentals (23 EC) ",null,null,{"$f":"SUM(E28:E31)","v":23},{"$f":"IF(E2=23, \"Correct\", \"Insufficient\")","v":"Correct"},null,"Short explanation"]
[null,null,null,null,null,null,null,"> This excel sheet can be used to determine how the years of your master degree will look like. It presents an overview of the courses that can be followed in each quarter and may thus help to plan your studies. \n> First, you have to fill in the course planner by ticking the 'no' boxes into 'yes' for the courses you'd like to follow. If the overview says 'correct' you fulfilled all requirements. After that, click the blue button \"Calculate ECTS\" on the tab courses chosen. The chosen courses are subsequently exported to the Courses Chosen tab and your ECTS are calculated.\n> In the courses chosen tab, you can check whether you miss any courses in the schedule. This is also indicated in the schedule planner tab, if the scheduled credits don't add up to the chosen number of credits.  You can schedule your courses based on course code by making use of the drop down menu in the year overview. The corresponding course name and number of credits will be filled in for you. In the same overview you see the total number of credits you will follow in each quarter. \n> Ending up around 15 ECTS makes the study load doable. "]
[null,"Specialisations (27 EC) (1 specialisation) ",null,null,{"$f":"SUM(E5:E8)","v":0},{"$f":"IF(E4>=27, \"Correct\", \"Insufficient\")","v":"Insufficient"}]
[null,null,null,"Specialisation P - Policy: Infrastructure, Planning and Environment",{"$f":"IF(B34=\"Yes\", SUM(E35:E40), 0)","v":0}]
[null,null,null,"Specialisation D - Design: Transport Systems and Networks",{"$f":"IF(B42=\"Yes\", SUM(E43:E48), 0)","v":0}]
[null,null,null,"Specialisation O - Operations: Traffic, Technology and Control",{"$f":"IF(B51=\"Yes\", SUM(E52:E57), 0)","v":0}]
[null,null,null,"Specialisation E - Engineering: Transport, Logistics and Supply Chains",{"$f":"IF(B59=\"Yes\", SUM(E60:E65), 0)","v":0}]
[]
[null,"Electives (25 EC) ",null,null,{"$f":"SUM(E11:E15)","v":0},{"$f":"IF(E10>=25,\"Correct\",\"Insufficient\")","v":"Insufficient"}]
[null,null,"Electives T&P - Transport and Planning (at least 1 course) ",null,{"$f":"SUMIF(B69:B84, \"Yes\", E69:E84)","v":0},{"$f":"IF(E11>=1,\"Correct\",\"Insufficient\")","v":"Insufficient"}]
[null,null,"Electives T&L - Transport & Logistics (at least 1 course) ",null,{"$f":"SUMIF(B87:B97, \"Yes\",E87:E96)","v":0},{"$f":"IF(E12>=1,\"Correct\",\"Insufficient\")","v":"Insufficient"}]
[null,null,"Electives MME - Multi Machine Engineering (at least 1 course) ",null,{"$f":"SUMIF(B100:B110, \"Yes\",E100:E110)","v":0},{"$f":"IF(E13>=1,\"Correct\",\"Insufficient\")","v":"Insufficient"}]
[null,null,"External Electives (at least 1 course)",null,{"$f":"SUMIF(B114:B135, \"Yes\",E114:E135)","v":0},{"$f":"IF(E14>=1,\"Correct\",\"Insufficient\")","v":"Insufficient"}]
[null,null,"Free electives",null,{"$f":"SUMIF(B138:B140, \"Yes\",E138:E140)","v":0},null,null,"Some Remarks"]
[null,null,null,null,null,null,null,"> This form can be used as an indication. In all cases the study regulations should be followed.\n> For more information about the courses see: studyguide.tudelft.nl\n> In the schedule planner, resits are not considered. \n> Courses that extend over two periods will only show up as counted in the second period in this system, so keep that in mind. Also, the real study load per period varies, so please check it in the respective study guide.\n> Optional courses should be filled in completely to make the system work\n> MSC Thesis can be followed in each quarter, so also Q5, but you have to find your own mentor. In the Schedule planner the ECTS load is not divided into different quarters\nAny questions or comments can be sent to: education@dispuutverkeer.nl"]
[null,"TIL Projects (15 EC)",null,null,{"$f":"SUMIF(B143:B144, \"Yes\", E143:E144)","v":0},{"$f":"IF(E17=15,\"Correct\",\"Insufficient\")","v":"Insufficient"}]
[]
[null,"Thesis (30 EC) ",null,null,{"$f":"IF(B147=\"Yes\", SUM(E147), 0)","v":0},{"$f":"IF(E19=30,\"Correct\",\"Insufficient\")","v":"Insufficient"}]
[]
{"$rows_left_out":142}
{"sheet":"Schedule planner","index":1,"n_rows":135,"n_cols":14,"rows_kept":135,"cut":false,"hidden":false,"merged":[]}
[]
[null,"Year 1","Q1","Name","ECTS","Q2","Name","ECTS","Q3","Name","ECTS","Q4","Name","ECTS"]
[null,null,null,{"$f":"VLOOKUP($C$3,$A$48:$D$136,2,FALSE)","v":{"$error":"#N/A"}},{"$f":"IFERROR(IF(OR(C3=\"TIL4030-20\",C3=\"ME44206\",C3=\"TIL5050-20\"),\"\",VLOOKUP($C3,$A$48:$D$136,3,FALSE)),\"\")","v":""},null,{"$f":"VLOOKUP($F3,$A$48:$D$136,2,FALSE)","v":{"$error":"#N/A"}},{"$f":"IFERROR(VLOOKUP($F3,$A$48:$D$136,3,FALSE),\"\")","v":""},null,{"$f":"VLOOKUP($I3,$A$48:$D$136,2,FALSE)","v":{"$error":"#N/A"}},{"$f":"IFERROR(VLOOKUP($I3,$A$48:$D$136,3,FALSE),\"\")","v":""},null,{"$f":"VLOOKUP($L3,$A$48:$D$136,2,FALSE)","v":{"$error":"#N/A"}},{"$f":"IFERROR(VLOOKUP($L3,$A$48:$D$136,3,FALSE),\"\")","v":""}]
[null,null,null,{"$f":"VLOOKUP(C4,$A$48:$D$136,2,FALSE)","v":{"$error":"#N/A"}},{"$f":"IFERROR(IF(OR(C4=\"TIL4030-20\",C4=\"ME44206\",C4=\"TIL5050-20\"),\"\",VLOOKUP($C4,$A$48:$D$136,3,FALSE)),\"\")","v":""},null,{"$error":"#N/A"},{"$f":"IFERROR(VLOOKUP($F4,$A$48:$D$136,3,FALSE),\"\")","v":""},null,{"$f":"VLOOKUP($I4,$A$48:$D$136,2,FALSE)","v":{"$error":"#N/A"}},{"$f":"IFERROR(VLOOKUP($I4,$A$48:$D$136,3,FALSE),\"\")","v":""},null,{"$f":"VLOOKUP($L4,$A$48:$D$136,2,FALSE)","v":{"$error":"#N/A"}},{"$f":"IFERROR(VLOOKUP($L4,$A$48:$D$136,3,FALSE),\"\")","v":""}]
[null,null,null,{"$f":"VLOOKUP(C5,$A$48:$D$136,2,FALSE)","v":{"$error":"#N/A"}},"",null,{"$error":"#N/A"},"",null,{"$error":"#N/A"},"",null,{"$error":"#N/A"},""]
[null,null,null,{"$f":"VLOOKUP(C6,$A$48:$D$136,2,FALSE)","v":{"$error":"#N/A"}},"",null,{"$error":"#N/A"},"",null,{"$error":"#N/A"},"",null,{"$error":"#N/A"},""]
[null,null,null,{"$f":"VLOOKUP(C7,$A$48:$D$136,2,FALSE)","v":{"$error":"#N/A"}},"",null,{"$error":"#N/A"},"",null,{"$error":"#N/A"},"",null,{"$error":"#N/A"},""]
[null,null,null,{"$f":"VLOOKUP(C8,$A$48:$D$136,2,FALSE)","v":{"$error":"#N/A"}},"",null,{"$error":"#N/A"},"",null,{"$error":"#N/A"},"",null,{"$error":"#N/A"},""]
[null,null,null,null,{"$f":"SUM(E3:E8)","v":0},null,null,{"$f":"SUM(H3:H8)","v":0},null,null,{"$f":"SUM(K3:K8)","v":0},null,null,{"$f":"SUM(N3:N8)","v":0}]
[]
[null,"Year 2","Q1","Name","ECTS","Q2","Name","ECTS","Q3","Name","ECTS","Q4","Name","ECTS"]
[null,null,null,{"$f":"VLOOKUP($C12,$A$48:$D$136,2,FALSE)","v":{"$error":"#N/A"}},{"$f":"IFERROR(IF(OR(C12=\"TIL4030-20\",C12=\"ME44206\",C12=\"TIL5050-20\"),\"\",VLOOKUP($C12,$A$48:$D$136,3,FALSE)),\"\")","v":""},null,{"$f":"VLOOKUP($F12,$A$48:$D$136,2,FALSE)","v":{"$error":"#N/A"}},{"$f":"IFERROR(VLOOKUP($F12,$A$48:$D$136,3,FALSE),\"\")","v":""},null,{"$f":"VLOOKUP($I12,$A$48:$D$136,2,FALSE)","v":{"$error":"#N/A"}},{"$f":"IFERROR(VLOOKUP($I12,$A$48:$D$136,3,FALSE),\"\")","v":""},null,{"$f":"VLOOKUP($L12,$A$48:$D$136,2,FALSE)","v":{"$error":"#N/A"}},{"$f":"IFERROR(VLOOKUP($L12,$A$48:$D$136,3,FALSE),\"\")","v":""}]
[null,null,null,{"$f":"VLOOKUP($C13,$A$48:$D$136,2,FALSE)","v":{"$error":"#N/A"}},"",null,{"$error":"#N/A"},"",null,{"$error":"#N/A"},"",null,{"$error":"#N/A"},""]
[null,null,null,{"$error":"#N/A"},"",null,{"$error":"#N/A"},"",null,{"$error":"#N/A"},"",null,{"$error":"#N/A"},""]
[null,null,null,{"$error":"#N/A"},"",null,{"$error":"#N/A"},"",null,{"$error":"#N/A"},"",null,{"$error":"#N/A"},""]
[null,null,null,{"$error":"#N/A"},"",null,{"$error":"#N/A"},"",null,{"$error":"#N/A"},"",null,{"$error":"#N/A"},""]
[null,null,null,{"$error":"#N/A"},"",null,{"$error":"#N/A"},"",null,{"$error":"#N/A"},"",null,{"$error":"#N/A"},""]
[null,null,null,null,{"$f":"SUM(E12:E17)","v":0},null,null,{"$f":"SUM(H12:H17)","v":0},null,null,{"$f":"SUM(K12:K17)","v":0},null,null,{"$f":"SUM(N12:N17)","v":0}]
[]
[null,"Year 3","Q1","Name","ECTS","Q2","Name","ECTS","Q3","Name","ECTS","Q4","Name","ECTS"]
{"$rows_left_out":116}
{"sheet":"Courses chosen","index":2,"n_rows":240,"n_cols":7,"rows_kept":240,"cut":false,"hidden":false,"merged":[]}
[null,null,null,null,null,"Quarter","ECTS"]
["Name","ECTS","Quarter","Check",null,"Q1",0]
[{"$f":"IFERROR(VLOOKUP(\"YES\",'Course planner'!$B31:G31,2,FALSE),\"\")","v":"TIL4030-20"},{"$f":"IFERROR(VLOOKUP(\"YES\",'Course planner'!$B31:G31,4,FALSE),\"\")","v":7},{"$f":"IFERROR(VLOOKUP(\"Yes\", 'Course planner'!B31:G31,5,FALSE),\"\")","v":1.2},{"$f":"IFERROR(IF(IF(Table1[[#This Row],[Quarter]]=3,MATCH(Table1[[#This Row],[Name]],'Schedule planner'!$I$3:$I$26,FALSE), IF(OR(Table1[[#This Row],[Quarter]]=1,Table1[[#This Row],[Quarter]]=1.2),MATCH(Table1[[#This Row],[Name]],'Schedule planner'!$C$3:$C$26,FALSE),IF(Table1[[#This Row],[Quarter]]=2,MATCH(Table1[[#This Row],[Name]],'Schedule planner'!$F$3:$F$26,FALSE),MATCH(Table1[[#This Row],[Name]],'Schedule planner'!$L$3:$L$26,FALSE)))),\"all good\",\"you need to schedule this course\"),\"you need to schedule this course\")","v":"you need to schedule this course"},null,"Q2",5]
[{"$f":"IFERROR(VLOOKUP(\"YES\",'Course planner'!$B30:G30,2,FALSE),\"\")","v":"SEN1221"},{"$f":"IFERROR(VLOOKUP(\"YES\",'Course planner'!$B30:G30,4,FALSE),\"\")","v":5},{"$f":"IFERROR(VLOOKUP(\"Yes\", 'Course planner'!B30:G30,5,FALSE),\"\")","v":2},{"$f":"IFERROR(IF(IF(Table1[[#This Row],[Quarter]]=3,MATCH(Table1[[#This Row],[Name]],'Schedule planner'!$I$3:$I$26,FALSE), IF(OR(Table1[[#This Row],[Quarter]]=1,Table1[[#This Row],[Quarter]]=1.2),MATCH(Table1[[#This Row],[Name]],'Schedule planner'!$C$3:$C$26,FALSE),IF(Table1[[#This Row],[Quarter]]=2,MATCH(Table1[[#This Row],[Name]],'Schedule planner'!$F$3:$F$26,FALSE),MATCH(Table1[[#This Row],[Name]],'Schedule planner'!$L$3:$L$26,FALSE)))),\"all good\",\"you need to schedule this course\"),\"you need to schedule this course\")","v":"you need to schedule this course"},null,"Q3",0]
[{"$f":"IFERROR(VLOOKUP(\"YES\",'Course planner'!$B29:G29,2,FALSE),\"\")","v":"ME44206"},{"$f":"IFERROR(VLOOKUP(\"YES\",'Course planner'!$B29:G29,4,FALSE),\"\")","v":5},{"$f":"IFERROR(VLOOKUP(\"Yes\", 'Course planner'!B29:G29,5,FALSE),\"\")","v":1.2},{"$f":"IFERROR(IF(IF(Table1[[#This Row],[Quarter]]=3,MATCH(Table1[[#This Row],[Name]],'Schedule planner'!$I$3:$I$26,FALSE), IF(OR(Table1[[#This Row],[Quarter]]=1,Table1[[#This Row],[Quarter]]=1.2),MATCH(Table1[[#This Row],[Name]],'Schedule planner'!$C$3:$C$26,FALSE),IF(Table1[[#This Row],[Quarter]]=2,MATCH(Table1[[#This Row],[Name]],'Schedule planner'!$F$3:$F$26,FALSE),MATCH(Table1[[#This Row],[Name]],'Schedule planner'!$L$3:$L$26,FALSE)))),\"all good\",\"you need to schedule this course\"),\"you need to schedule this course\")","v":"you need to schedule this course"},null,"Q4",0]
[{"$f":"IFERROR(VLOOKUP(\"YES\",'Course planner'!$B135:G135,2,FALSE),\"\")","v":""},{"$f":"IFERROR(VLOOKUP(\"YES\",'Course planner'!$B135:G135,4,FALSE),\"\")","v":""},{"$f":"IFERROR(VLOOKUP(\"Yes\", 'Course planner'!B135:G135,5,FALSE),\"\")","v":""},{"$f":"IFERROR(IF(IF(Table1[[#This Row],[Quarter]]=3,MATCH(Table1[[#This Row],[Name]],'Schedule planner'!$I$3:$I$26,FALSE), IF(OR(Table1[[#This Row],[Quarter]]=1,Table1[[#This Row],[Quarter]]=1.2),MATCH(Table1[[#This Row],[Name]],'Schedule planner'!$C$3:$C$26,FALSE),IF(Table1[[#This Row],[Quarter]]=2,MATCH(Table1[[#This Row],[Name]],'Schedule planner'!$F$3:$F$26,FALSE),MATCH(Table1[[#This Row],[Name]],'Schedule planner'!$L$3:$L$26,FALSE)))),\"all good\",\"you need to schedule this course\"),\"you need to schedule this course\")","v":"you need to schedule this course"},null,"Q1+Q2",12]
[{"$f":"IFERROR(VLOOKUP(\"YES\",'Course planner'!$B138:G138,2,FALSE),\"\")","v":""},{"$f":"IFERROR(VLOOKUP(\"YES\",'Course planner'!$B138:G138,4,FALSE),\"\")","v":""},{"$f":"IFERROR(VLOOKUP(\"Yes\", 'Course planner'!B138:G138,5,FALSE),\"\")","v":""},{"$f":"IFERROR(IF(IF(Table1[[#This Row],[Quarter]]=3,MATCH(Table1[[#This Row],[Name]],'Schedule planner'!$I$3:$I$26,FALSE), IF(OR(Table1[[#This Row],[Quarter]]=1,Table1[[#This Row],[Quarter]]=1.2),MATCH(Table1[[#This Row],[Name]],'Schedule planner'!$C$3:$C$26,FALSE),IF(Table1[[#This Row],[Quarter]]=2,MATCH(Table1[[#This Row],[Name]],'Schedule planner'!$F$3:$F$26,FALSE),MATCH(Table1[[#This Row],[Name]],'Schedule planner'!$L$3:$L$26,FALSE)))),\"all good\",\"you need to schedule this course\"),\"you need to schedule this course\")","v":"you need to schedule this course"},null,"Q2+Q3",0]
[{"$f":"IFERROR(VLOOKUP(\"YES\",'Course planner'!$B147:G147,2,FALSE),\"\")","v":""},{"$f":"IFERROR(VLOOKUP(\"YES\",'Course planner'!$B147:G147,4,FALSE),\"\")","v":""},{"$f":"IFERROR(VLOOKUP(\"Yes\", 'Course planner'!B147:G147,5,FALSE),\"\")","v":""},{"$f":"IFERROR(IF(IF(Table1[[#This Row],[Quarter]]=3,MATCH(Table1[[#This Row],[Name]],'Schedule planner'!$I$3:$I$26,FALSE), IF(OR(Table1[[#This Row],[Quarter]]=1,Table1[[#This Row],[Quarter]]=1.2),MATCH(Table1[[#This Row],[Name]],'Schedule planner'!$C$3:$C$26,FALSE),IF(Table1[[#This Row],[Quarter]]=2,MATCH(Table1[[#This Row],[Name]],'Schedule planner'!$F$3:$F$26,FALSE),MATCH(Table1[[#This Row],[Name]],'Schedule planner'!$L$3:$L$26,FALSE)))),\"all good\",\"you need to schedule this course\"),\"you need to schedule this course\")","v":"you need to schedule this course"},null,"Q3+Q4",0]
[{"$f":"IFERROR(VLOOKUP(\"YES\",'Course planner'!$B144:G144,2,FALSE),\"\")","v":""},{"$f":"IFERROR(VLOOKUP(\"YES\",'Course planner'!$B144:G144,4,FALSE),\"\")","v":""},{"$f":"IFERROR(VLOOKUP(\"Yes\", 'Course planner'!B144:G144,5,FALSE),\"\")","v":""},{"$f":"IFERROR(IF(IF(Table1[[#This Row],[Quarter]]=3,MATCH(Table1[[#This Row],[Name]],'Schedule planner'!$I$3:$I$26,FALSE), IF(OR(Table1[[#This Row],[Quarter]]=1,Table1[[#This Row],[Quarter]]=1.2),MATCH(Table1[[#This Row],[Name]],'Schedule planner'!$C$3:$C$26,FALSE),IF(Table1[[#This Row],[Quarter]]=2,MATCH(Table1[[#This Row],[Name]],'Schedule planner'!$F$3:$F$26,FALSE),MATCH(Table1[[#This Row],[Name]],'Schedule planner'!$L$3:$L$26,FALSE)))),\"all good\",\"you need to schedule this course\"),\"you need to schedule this course\")","v":"you need to schedule this course"},null,null,{"$f":"SUM(G2:G8)","v":17}]
[{"$f":"IFERROR(VLOOKUP(\"YES\",'Course planner'!$B143:G143,2,FALSE),\"\")","v":""},{"$f":"IFERROR(VLOOKUP(\"YES\",'Course planner'!$B143:G143,4,FALSE),\"\")","v":""},{"$f":"IFERROR(VLOOKUP(\"Yes\", 'Course planner'!B143:G143,5,FALSE),\"\")","v":""},{"$f":"IFERROR(IF(IF(Table1[[#This Row],[Quarter]]=3,MATCH(Table1[[#This Row],[Name]],'Schedule planner'!$I$3:$I$26,FALSE), IF(OR(Table1[[#This Row],[Quarter]]=1,Table1[[#This Row],[Quarter]]=1.2),MATCH(Table1[[#This Row],[Name]],'Schedule planner'!$C$3:$C$26,FALSE),IF(Table1[[#This Row],[Quarter]]=2,MATCH(Table1[[#This Row],[Name]],'Schedule planner'!$F$3:$F$26,FALSE),MATCH(Table1[[#This Row],[Name]],'Schedule planner'!$L$3:$L$26,FALSE)))),\"all good\",\"you need to schedule this course\"),\"you need to schedule this course\")","v":"you need to schedule this course"}]
[{"$f":"IFERROR(VLOOKUP(\"YES\",'Course planner'!$B42:G42,2,FALSE),\"\")","v":""},{"$f":"IFERROR(VLOOKUP(\"YES\",'Course planner'!$B42:G42,4,FALSE),\"\")","v":""},{"$f":"IFERROR(VLOOKUP(\"Yes\", 'Course planner'!B42:G42,5,FALSE),\"\")","v":""},{"$f":"IFERROR(IF(IF(Table1[[#This Row],[Quarter]]=3,MATCH(Table1[[#This Row],[Name]],'Schedule planner'!$I$3:$I$26,FALSE), IF(OR(Table1[[#This Row],[Quarter]]=1,Table1[[#This Row],[Quarter]]=1.2),MATCH(Table1[[#This Row],[Name]],'Schedule planner'!$C$3:$C$26,FALSE),IF(Table1[[#This Row],[Quarter]]=2,MATCH(Table1[[#This Row],[Name]],'Schedule planner'!$F$3:$F$26,FALSE),MATCH(Table1[[#This Row],[Name]],'Schedule planner'!$L$3:$L$26,FALSE)))),\"all good\",\"you need to schedule this course\"),\"you need to schedule this course\")","v":"you need to schedule this course"}]
[{"$f":"IFERROR(VLOOKUP(\"YES\",'Course planner'!$B91:G91,2,FALSE),\"\")","v":""},{"$f":"IFERROR(VLOOKUP(\"YES\",'Course planner'!$B91:G91,4,FALSE),\"\")","v":""},{"$f":"IFERROR(VLOOKUP(\"Yes\", 'Course planner'!B91:G91,5,FALSE),\"\")","v":""},{"$f":"IFERROR(IF(IF(Table1[[#This Row],[Quarter]]=3,MATCH(Table1[[#This Row],[Name]],'Schedule planner'!$I$3:$I$26,FALSE), IF(OR(Table1[[#This Row],[Quarter]]=1,Table1[[#This Row],[Quarter]]=1.2),MATCH(Table1[[#This Row],[Name]],'Schedule planner'!$C$3:$C$26,FALSE),IF(Table1[[#This Row],[Quarter]]=2,MATCH(Table1[[#This Row],[Name]],'Schedule planner'!$F$3:$F$26,FALSE),MATCH(Table1[[#This Row],[Name]],'Schedule planner'!$L$3:$L$26,FALSE)))),\"all good\",\"you need to schedule this course\"),\"you need to schedule this course\")","v":"you need to schedule this course"}]
[{"$f":"IFERROR(VLOOKUP(\"YES\",'Course planner'!$B48:G48,2,FALSE),\"\")","v":""},{"$f":"IFERROR(VLOOKUP(\"YES\",'Course planner'!$B48:G48,4,FALSE),\"\")","v":""},{"$f":"IFERROR(VLOOKUP(\"Yes\", 'Course planner'!B48:G48,5,FALSE),\"\")","v":""},{"$f":"IFERROR(IF(IF(Table1[[#This Row],[Quarter]]=3,MATCH(Table1[[#This Row],[Name]],'Schedule planner'!$I$3:$I$26,FALSE), IF(OR(Table1[[#This Row],[Quarter]]=1,Table1[[#This Row],[Quarter]]=1.2),MATCH(Table1[[#This Row],[Name]],'Schedule planner'!$C$3:$C$26,FALSE),IF(Table1[[#This Row],[Quarter]]=2,MATCH(Table1[[#This Row],[Name]],'Schedule planner'!$F$3:$F$26,FALSE),MATCH(Table1[[#This Row],[Name]],'Schedule planner'!$L$3:$L$26,FALSE)))),\"all good\",\"you need to schedule this course\"),\"you need to schedule this course\")","v":"you need to schedule this course"}]
[{"$f":"IFERROR(VLOOKUP(\"YES\",'Course planner'!$B88:G88,2,FALSE),\"\")","v":""},{"$f":"IFERROR(VLOOKUP(\"YES\",'Course planner'!$B88:G88,4,FALSE),\"\")","v":""},{"$f":"IFERROR(VLOOKUP(\"Yes\", 'Course planner'!B88:G88,5,FALSE),\"\")","v":""},{"$f":"IFERROR(IF(IF(Table1[[#This Row],[Quarter]]=3,MATCH(Table1[[#This Row],[Name]],'Schedule planner'!$I$3:$I$26,FALSE), IF(OR(Table1[[#This Row],[Quarter]]=1,Table1[[#This Row],[Quarter]]=1.2),MATCH(Table1[[#This Row],[Name]],'Schedule planner'!$C$3:$C$26,FALSE),IF(Table1[[#This Row],[Quarter]]=2,MATCH(Table1[[#This Row],[Name]],'Schedule planner'!$F$3:$F$26,FALSE),MATCH(Table1[[#This Row],[Name]],'Schedule planner'!$L$3:$L$26,FALSE)))),\"all good\",\"you need to schedule this course\"),\"you need to schedule this course\")","v":"you need to schedule this course"}]
[{"$f":"IFERROR(VLOOKUP(\"YES\",'Course planner'!$B109:G109,2,FALSE),\"\")","v":""},{"$f":"IFERROR(VLOOKUP(\"YES\",'Course planner'!$B109:G109,4,FALSE),\"\")","v":""},{"$f":"IFERROR(VLOOKUP(\"Yes\", 'Course planner'!B109:G109,5,FALSE),\"\")","v":""},{"$f":"IFERROR(IF(IF(Table1[[#This Row],[Quarter]]=3,MATCH(Table1[[#This Row],[Name]],'Schedule planner'!$I$3:$I$26,FALSE), IF(OR(Table1[[#This Row],[Quarter]]=1,Table1[[#This Row],[Quarter]]=1.2),MATCH(Table1[[#This Row],[Name]],'Schedule planner'!$C$3:$C$26,FALSE),IF(Table1[[#This Row],[Quarter]]=2,MATCH(Table1[[#This Row],[Name]],'Schedule planner'!$F$3:$F$26,FALSE),MATCH(Table1[[#This Row],[Name]],'Schedule planner'!$L$3:$L$26,FALSE)))),\"all good\",\"you need to schedule this course\"),\"you need to schedule this course\")","v":"you need to schedule this course"}]
[{"$f":"IFERROR(VLOOKUP(\"YES\",'Course planner'!$B130:G130,2,FALSE),\"\")","v":""},{"$f":"IFERROR(VLOOKUP(\"YES\",'Course planner'!$B130:G130,4,FALSE),\"\")","v":""},{"$f":"IFERROR(VLOOKUP(\"Yes\", 'Course planner'!B130:G130,5,FALSE),\"\")","v":""},{"$f":"IFERROR(IF(IF(Table1[[#This Row],[Quarter]]=3,MATCH(Table1[[#This Row],[Name]],'Schedule planner'!$I$3:$I$26,FALSE), IF(OR(Table1[[#This Row],[Quarter]]=1,Table1[[#This Row],[Quarter]]=1.2),MATCH(Table1[[#This Row],[Name]],'Schedule planner'!$C$3:$C$26,FALSE),IF(Table1[[#This Row],[Quarter]]=2,MATCH(Table1[[#This Row],[Name]],'Schedule planner'!$F$3:$F$26,FALSE),MATCH(Table1[[#This Row],[Name]],'Schedule planner'!$L$3:$L$26,FALSE)))),\"all good\",\"you need to schedule this course\"),\"you need to schedule this course\")","v":"you need to schedule this course"}]
[{"$f":"IFERROR(VLOOKUP(\"YES\",'Course planner'!$B47:G47,2,FALSE),\"\")","v":""},{"$f":"IFERROR(VLOOKUP(\"YES\",'Course planner'!$B47:G47,4,FALSE),\"\")","v":""},{"$f":"IFERROR(VLOOKUP(\"Yes\", 'Course planner'!B47:G47,5,FALSE),\"\")","v":""},{"$f":"IFERROR(IF(IF(Table1[[#This Row],[Quarter]]=3,MATCH(Table1[[#This Row],[Name]],'Schedule planner'!$I$3:$I$26,FALSE), IF(OR(Table1[[#This Row],[Quarter]]=1,Table1[[#This Row],[Quarter]]=1.2),MATCH(Table1[[#This Row],[Name]],'Schedule planner'!$C$3:$C$26,FALSE),IF(Table1[[#This Row],[Quarter]]=2,MATCH(Table1[[#This Row],[Name]],'Schedule planner'!$F$3:$F$26,FALSE),MATCH(Table1[[#This Row],[Name]],'Schedule planner'!$L$3:$L$26,FALSE)))),\"all good\",\"you need to schedule this course\"),\"you need to schedule this course\")","v":"you need to schedule this course"}]
[{"$f":"IFERROR(VLOOKUP(\"YES\",'Course planner'!$B78:G78,2,FALSE),\"\")","v":""},{"$f":"IFERROR(VLOOKUP(\"YES\",'Course planner'!$B78:G78,4,FALSE),\"\")","v":""},{"$f":"IFERROR(VLOOKUP(\"Yes\", 'Course planner'!B78:G78,5,FALSE),\"\")","v":""},{"$f":"IFERROR(IF(IF(Table1[[#This Row],[Quarter]]=3,MATCH(Table1[[#This Row],[Name]],'Schedule planner'!$I$3:$I$26,FALSE), IF(OR(Table1[[#This Row],[Quarter]]=1,Table1[[#This Row],[Quarter]]=1.2),MATCH(Table1[[#This Row],[Name]],'Schedule planner'!$C$3:$C$26,FALSE),IF(Table1[[#This Row],[Quarter]]=2,MATCH(Table1[[#This Row],[Name]],'Schedule planner'!$F$3:$F$26,FALSE),MATCH(Table1[[#This Row],[Name]],'Schedule planner'!$L$3:$L$26,FALSE)))),\"all good\",\"you need to schedule this course\"),\"you need to schedule this course\")","v":"you need to schedule this course"}]
[{"$f":"IFERROR(VLOOKUP(\"YES\",'Course planner'!$B46:G46,2,FALSE),\"\")","v":""},{"$f":"IFERROR(VLOOKUP(\"YES\",'Course planner'!$B46:G46,4,FALSE),\"\")","v":""},{"$f":"IFERROR(VLOOKUP(\"Yes\", 'Course planner'!B46:G46,5,FALSE),\"\")","v":""},{"$f":"IFERROR(IF(IF(Table1[[#This Row],[Quarter]]=3,MATCH(Table1[[#This Row],[Name]],'Schedule planner'!$I$3:$I$26,FALSE), IF(OR(Table1[[#This Row],[Quarter]]=1,Table1[[#This Row],[Quarter]]=1.2),MATCH(Table1[[#This Row],[Name]],'Schedule planner'!$C$3:$C$26,FALSE),IF(Table1[[#This Row],[Quarter]]=2,MATCH(Table1[[#This Row],[Name]],'Schedule planner'!$F$3:$F$26,FALSE),MATCH(Table1[[#This Row],[Name]],'Schedule planner'!$L$3:$L$26,FALSE)))),\"all good\",\"you need to schedule this course\"),\"you need to schedule this course\")","v":"you need to schedule this course"}]
[{"$f":"IFERROR(VLOOKUP(\"YES\",'Course planner'!$B45:G45,2,FALSE),\"\")","v":""},{"$f":"IFERROR(VLOOKUP(\"YES\",'Course planner'!$B45:G45,4,FALSE),\"\")","v":""},{"$f":"IFERROR(VLOOKUP(\"Yes\", 'Course planner'!B45:G45,5,FALSE),\"\")","v":""},{"$f":"IFERROR(IF(IF(Table1[[#This Row],[Quarter]]=3,MATCH(Table1[[#This Row],[Name]],'Schedule planner'!$I$3:$I$26,FALSE), IF(OR(Table1[[#This Row],[Quarter]]=1,Table1[[#This Row],[Quarter]]=1.2),MATCH(Table1[[#This Row],[Name]],'Schedule planner'!$C$3:$C$26,FALSE),IF(Table1[[#This Row],[Quarter]]=2,MATCH(Table1[[#This Row],[Name]],'Schedule planner'!$F$3:$F$26,FALSE),MATCH(Table1[[#This Row],[Name]],'Schedule planner'!$L$3:$L$26,FALSE)))),\"all good\",\"you need to schedule this course\"),\"you need to schedule this course\")","v":"you need to schedule this course"}]
{"$rows_left_out":220}